Language:
switch to room list switch to menu My folders
Go to page: First ... 115 116 117 118 [119] 120 121 122 123 ... Last
[#] Tue Oct 03 2017 17:03:17 EDT from bennabiy @ Uncensored

Subject: Re: RPi2 Debian Stretch: Easy Install failing at serv_crypto.o

[Reply] [ReplyQuoted] [Headers] [Print]

You did install all dependencies, correct?

Tue Oct 03 2017 04:09:16 AM EDT from madpoet @ Uncensored Subject: RPi2 Debian Stretch: Easy Install failing at serv_crypto.o

RPi2 Debian Stretch: Easy Install failing at serv_crypto.o
Platform: Raspberry Pi 2
Operating system: Linux Debian 9.1 ( 4.9.41-v7+ armv7l)
emohym:~$ cat /tmp/citadel-install-log.txt   
--2017-10-03 07:36:25--  http://easyinstall.citadel.org/gpl.txt
Resolving easyinstall.citadel.org (easyinstall.citadel.org)... 216.150.130.115
Connecting to easyinstall.citadel.org (easyinstall.citadel.org)|216.150.130.115|:80... connected.
HTTP request sent, awaiting response... 200 OK
Length: 32553 (32K) [text/plain]
Saving to: 'gpl.txt'

     0K .......... .......... .......... .                    100%  119K=0.3s

2017-10-03 07:36:26 (119 KB/s) - 'gpl.txt' saved [32553/32553]

--2017-10-03 07:36:29--  http://easyinstall.citadel.org/libical-easyinstall.sum
Resolving easyinstall.citadel.org (easyinstall.citadel.org)... 216.150.130.115
Connecting to easyinstall.citadel.org (easyinstall.citadel.org)|216.150.130.115|:80... connected.
HTTP request sent, awaiting response... 200 OK
Length: 33 [text/plain]
Saving to: 'libical-easyinstall.sum'

     0K                                                       100%  831K=0s

2017-10-03 07:36:29 (831 KB/s) - 'libical-easyinstall.sum' saved [33/33]

--2017-10-03 07:36:29--  http://easyinstall.citadel.org/libsieve-easyinstall.sum
Resolving easyinstall.citadel.org (easyinstall.citadel.org)... 216.150.130.115
Connecting to easyinstall.citadel.org (easyinstall.citadel.org)|216.150.130.115|:80... connected.
HTTP request sent, awaiting response... 200 OK
Length: 9 [text/plain]
Saving to: 'libsieve-easyinstall.sum'

     0K                                                       100%  204K=0s

2017-10-03 07:36:30 (204 KB/s) - 'libsieve-easyinstall.sum' saved [9/9]

--2017-10-03 07:36:30--  http://easyinstall.citadel.org/db-easyinstall.sum
Resolving easyinstall.citadel.org (easyinstall.citadel.org)... 216.150.130.115
Connecting to easyinstall.citadel.org (easyinstall.citadel.org)|216.150.130.115|:80... connected.
HTTP request sent, awaiting response... 200 OK
Length: 33 [text/plain]
Saving to: 'db-easyinstall.sum'

     0K                                                       100%  820K=0s

2017-10-03 07:36:30 (820 KB/s) - 'db-easyinstall.sum' saved [33/33]

--2017-10-03 07:36:30--  http://easyinstall.citadel.org/expat-easyinstall.sum
Resolving easyinstall.citadel.org (easyinstall.citadel.org)... 216.150.130.115
Connecting to easyinstall.citadel.org (easyinstall.citadel.org)|216.150.130.115|:80... connected.
HTTP request sent, awaiting response... 200 OK
Length: 33 [text/plain]
Saving to: 'expat-easyinstall.sum'

     0K                                                       100%  726K=0s

2017-10-03 07:36:30 (726 KB/s) - 'expat-easyinstall.sum' saved [33/33]

--2017-10-03 07:36:30--  http://easyinstall.citadel.org/libcurl-easyinstall.sum
Resolving easyinstall.citadel.org (easyinstall.citadel.org)... 216.150.130.115
Connecting to easyinstall.citadel.org (easyinstall.citadel.org)|216.150.130.115|:80... connected.
HTTP request sent, awaiting response... 200 OK
Length: 33 [text/plain]
Saving to: 'libcurl-easyinstall.sum'

     0K                                                       100%  832K=0s

2017-10-03 07:36:30 (832 KB/s) - 'libcurl-easyinstall.sum' saved [33/33]

--2017-10-03 07:36:30--  http://easyinstall.citadel.org/libcitadel-easyinstall.sum
Resolving easyinstall.citadel.org (easyinstall.citadel.org)... 216.150.130.115
Connecting to easyinstall.citadel.org (easyinstall.citadel.org)|216.150.130.115|:80... connected.
HTTP request sent, awaiting response... 200 OK
Length: 41 [text/plain]
Saving to: 'libcitadel-easyinstall.sum'

     0K                                                       100%  938K=0s

2017-10-03 07:36:31 (938 KB/s) - 'libcitadel-easyinstall.sum' saved [41/41]

--2017-10-03 07:36:31--  http://easyinstall.citadel.org/citadel-easyinstall.sum
Resolving easyinstall.citadel.org (easyinstall.citadel.org)... 216.150.130.115
Connecting to easyinstall.citadel.org (easyinstall.citadel.org)|216.150.130.115|:80... connected.
HTTP request sent, awaiting response... 200 OK
Length: 41 [text/plain]
Saving to: 'citadel-easyinstall.sum'

     0K                                                       100% 1.07M=0s

2017-10-03 07:36:31 (1.07 MB/s) - 'citadel-easyinstall.sum' saved [41/41]

--2017-10-03 07:36:31--  http://easyinstall.citadel.org/citadel-easyinstall.tar.gz
Resolving easyinstall.citadel.org (easyinstall.citadel.org)... 216.150.130.115
Connecting to easyinstall.citadel.org (easyinstall.citadel.org)|216.150.130.115|:80... connected.
HTTP request sent, awaiting response... 200 OK
Length: 733679 (716K) [application/x-gzip]
Saving to: 'citadel-easyinstall.tar.gz'

     0K .......... .......... .......... .......... ..........  6%  176K 4s
    50K .......... .......... .......... .......... .......... 13%  501K 2s
   100K .......... .......... .......... .......... .......... 20%  581K 2s
   150K .......... .......... .......... .......... .......... 27% 1.65M 1s
   200K .......... .......... .......... .......... .......... 34%  712K 1s
   250K .......... .......... .......... .......... .......... 41% 2.04M 1s
   300K .......... .......... .......... .......... .......... 48% 1.84M 1s
   350K .......... .......... .......... .......... .......... 55% 1.24M 1s
   400K .......... .......... .......... .......... .......... 62% 2.06M 0s
   450K .......... .......... .......... .......... .......... 69% 1.88M 0s
   500K .......... .......... .......... .......... .......... 76% 2.09M 0s
   550K .......... .......... .......... .......... .......... 83% 1.81M 0s
   600K .......... .......... .......... .......... .......... 90% 2.05M 0s
   650K .......... .......... .......... .......... .......... 97%  504K 0s
   700K .......... ......                                     100% 18.1M=0.9s

2017-10-03 07:36:32 (811 KB/s) - 'citadel-easyinstall.tar.gz' saved [733679/733679]

configure: WARNING: unrecognized options: --with-libical, --disable-threaded-client
checking for gcc... gcc
checking whether the C compiler works... yes
checking for C compiler default output file name... a.out
checking for suffix of executables...
checking whether we are cross compiling... no
checking for suffix of object files... o
checking whether we are using the GNU C compiler... yes
checking whether gcc accepts -g... yes
checking for gcc option to accept ISO C89... none needed
checking how to run the C preprocessor... gcc -E
checking for grep that handles long lines and -e... /bin/grep
checking for egrep... /bin/grep -E
checking for ANSI C header files... yes
checking for sys/types.h... yes
checking for sys/stat.h... yes
checking for stdlib.h... yes
checking for string.h... yes
checking for memory.h... yes
checking for strings.h... yes
checking for inttypes.h... yes
checking for stdint.h... yes
checking for unistd.h... yes
checking minix/config.h usability... no
checking minix/config.h presence... no
checking for minix/config.h... no
checking whether it is safe to define __EXTENSIONS__... yes
checking zlib.h usability... yes
checking zlib.h presence... yes
checking for zlib.h... yes
checking for zlibVersion in -lz... yes
checking Checking to see if your system supports iconv... yes
Citadel will be built with character set conversion.
checking for libintl_bindtextdomain in -lintl... no
checking build system type... armv7l-unknown-linux-gnu
checking host system type... armv7l-unknown-linux-gnu
checking how to compile with POSIX threads... Linux
checking for gcc... (cached) gcc
checking whether we are using the GNU C compiler... (cached) yes
checking whether gcc accepts -g... (cached) yes
checking for gcc option to accept ISO C89... (cached) none needed
checking how to create dependancy checks... checking for a BSD-compatible install... /usr/bin/install -c
checking for bison... no
checking for byacc... no
checking for diff... /usr/bin/diff
checking for patch... /usr/bin/patch
/tmp/citadel-build.575/citadel/missing: Unknown `--is-lightweight' option
Try `/tmp/citadel-build.575/citadel/missing --help' for more information
configure: WARNING: 'missing' script is too old or missing
checking size of char... 1
checking size of short... 2
checking size of int... 4
checking size of long... 4
checking size of size_t... 4
checking size of loff_t... 8
checking for crypt... no
checking for gethostbyname... yes
checking for connect... yes
checking for getpwnam_r... yes
checking for getpwuid_r... yes
checking for getloadavg... yes
checking for strftime_l... yes
checking for uselocale... yes
checking for gettext... yes
checking for xgettext... yes
checking for msgmerge... yes
checking for msgfmt... yes
citadel will be built with national language support.
checking for sched_yield in -lrt... yes
checking for pam_start in -lpam... no
checking for pam_start... no
checking for library containing getspnam... none required
checking for crypt in -lcrypt... yes
checking for vw_printw... no
checking for wcolor_set... no
checking for resizeterm... no
checking for wresize... no
checking for pthread_create in -lpthread... yes
checking for pthread_create in -lpthreads... no
checking libical/ical.h usability... yes
checking libical/ical.h presence... yes
checking for libical/ical.h... yes
checking for icaltimezone_set_tzid_prefix in -lical... yes
checking sieve2.h usability... yes
checking sieve2.h presence... yes
checking for sieve2.h... yes
checking for sieve2_license in -lsieve... yes
checking libcitadel.h usability... yes
checking libcitadel.h presence... yes
checking for libcitadel.h... yes
checking for libcitadel_version_string in -lcitadel... yes
checking for OpenSSL... /usr/local/citadel
checking for db_create in -ldb... yes
checking ldap.h usability... no
checking ldap.h presence... no
checking for ldap.h... no
checking expat.h usability... yes
checking expat.h presence... yes
checking for expat.h... yes
checking for XML_ParserCreateNS in -lexpat... yes
checking curl/curl.h usability... yes
checking curl/curl.h presence... yes
checking for curl/curl.h... yes
checking for curl_version in -lcurl... yes
checking for dirent.h that defines DIR... yes
checking for library containing opendir... none required
checking for ANSI C header files... (cached) yes
checking for sys/wait.h that is POSIX.1 compatible... yes
checking dl.h usability... no
checking dl.h presence... no
checking for dl.h... no
checking fcntl.h usability... yes
checking fcntl.h presence... yes
checking for fcntl.h... yes
checking limits.h usability... yes
checking limits.h presence... yes
checking for limits.h... yes
checking malloc.h usability... yes
checking malloc.h presence... yes
checking for malloc.h... yes
checking termios.h usability... yes
checking termios.h presence... yes
checking for termios.h... yes
checking sys/ioctl.h usability... yes
checking sys/ioctl.h presence... yes
checking for sys/ioctl.h... yes
checking sys/select.h usability... yes
checking sys/select.h presence... yes
checking for sys/select.h... yes
checking for sys/stat.h... (cached) yes
checking sys/time.h usability... yes
checking sys/time.h presence... yes
checking for sys/time.h... yes
checking sys/prctl.h usability... yes
checking sys/prctl.h presence... yes
checking for sys/prctl.h... yes
checking syslog.h usability... yes
checking syslog.h presence... yes
checking for syslog.h... yes
checking for unistd.h... (cached) yes
checking utmp.h usability... yes
checking utmp.h presence... yes
checking for utmp.h... yes
checking utmpx.h usability... yes
checking utmpx.h presence... yes
checking for utmpx.h... yes
checking paths.h usability... yes
checking paths.h presence... yes
checking for paths.h... yes
checking db.h usability... yes
checking db.h presence... yes
checking for db.h... yes
checking db4/db.h usability... no
checking db4/db.h presence... no
checking for db4/db.h... no
checking pthread.h usability... yes
checking pthread.h presence... yes
checking for pthread.h... yes
checking netinet/in.h usability... yes
checking netinet/in.h presence... yes
checking for netinet/in.h... yes
checking arpa/nameser.h usability... yes
checking arpa/nameser.h presence... yes
checking for arpa/nameser.h... yes
checking arpa/nameser_compat.h usability... yes
checking arpa/nameser_compat.h presence... yes
checking for arpa/nameser_compat.h... yes
checking syscall.h usability... yes
checking syscall.h presence... yes
checking for syscall.h... yes
checking sys/syscall.h usability... yes
checking sys/syscall.h presence... yes
checking for sys/syscall.h... yes
checking for resolv.h... yes
checking for an ANSI C-conforming const... yes
checking for pid_t... yes
checking for size_t... yes
checking whether time.h and sys/time.h may both be included... yes
checking whether struct tm is in sys/time.h or time.h... time.h
checking for struct tm.tm_gmtoff... yes
checking for ut_type in struct utmp... yes
checking for call semantics from getpwuid_r... yes
checking for res_query in -lresolv... no
checking for res_query in -lresolv (with resolv.h if present)... yes
checking for ut_host in struct utmp... yes
checking whether getpgrp requires zero arguments... yes
checking whether gcc needs -traditional... no
checking return type of signal handlers... void
checking for vprintf... yes
checking for _doprnt... no
checking for getspnam... yes
checking for getutxline... yes
checking for mkdir... yes
checking for mkfifo... yes
checking for mktime... yes
checking for rmdir... yes
checking for select... yes
checking for socket... yes
checking for strerror... yes
checking for strcasecmp... yes
checking for strncasecmp... yes
checking for pthread_cancel... yes
checking for pthread_create... yes
checking the weather... opening your window... it's cool
checking under the bed... dust bunnies found
checking for struct ucred... yes
configure: creating ./config.status
config.status: creating Makefile
config.status: creating database_cleanup.sh
config.status: creating po/citadel-setup/Makefile
config.status: creating sysdep.h
configure: WARNING: unrecognized options: --with-libical, --disable-threaded-client
------------------------------------------------------------------------
LDAP support:                   
Character set conversion support: yes
Boehm-Demers-Weiser support:    

Note: if you are not using Linux, make sure you are using GNU make
(gmake) to compile Citadel.

Checking dependencies for modules_upgrade.c
Checking dependencies for modules_init.c
Checking dependencies for modules/xmpp/xmpp_sasl_service.c
Checking dependencies for modules/xmpp/xmpp_queue.c
Checking dependencies for modules/xmpp/xmpp_query_namespace.c
Checking dependencies for modules/xmpp/xmpp_presence.c
Checking dependencies for modules/xmpp/xmpp_messages.c
Checking dependencies for modules/xmpp/serv_xmpp.c
Checking dependencies for modules/wiki/serv_wiki.c
Checking dependencies for modules/vcard/serv_vcard.c
Checking dependencies for modules/upgrade/serv_upgrade.c
Checking dependencies for modules/test/serv_test.c
Checking dependencies for modules/spam/serv_spam.c
Checking dependencies for modules/smtp/smtp_util.c
Checking dependencies for modules/smtp/serv_smtpclient.c
Checking dependencies for modules/smtp/serv_smtp.c
Checking dependencies for modules/sieve/serv_sieve.c
Checking dependencies for modules/rwho/serv_rwho.c
Checking dependencies for modules/rssclient/serv_rssclient.c
Checking dependencies for modules/roomchat/serv_roomchat.c
Checking dependencies for modules/pop3client/serv_pop3client.c
Checking dependencies for modules/pop3/serv_pop3.c
Checking dependencies for modules/openid/serv_openid_rp.c
Checking dependencies for modules/notes/serv_notes.c
Checking dependencies for modules/nntp/wildmat.c
Checking dependencies for modules/nntp/serv_nntp.c
Checking dependencies for modules/newuser/serv_newuser.c
Checking dependencies for modules/networkclient/serv_networkclient.c
Checking dependencies for modules/network/serv_network.c
Checking dependencies for modules/network/serv_netspool.c
Checking dependencies for modules/network/serv_netmail.c
Checking dependencies for modules/network/serv_netfilter.c
Checking dependencies for modules/mrtg/serv_mrtg.c
Checking dependencies for modules/migrate/serv_migrate.c
Checking dependencies for modules/managesieve/serv_managesieve.c
Checking dependencies for modules/listsub/serv_listsub.c
Checking dependencies for modules/instmsg/serv_instmsg.c
Checking dependencies for modules/inetcfg/serv_inetcfg.c
Checking dependencies for modules/imap/serv_imap.c
Checking dependencies for modules/imap/imap_tools.c
Checking dependencies for modules/imap/imap_store.c
Checking dependencies for modules/imap/imap_search.c
Checking dependencies for modules/imap/imap_misc.c
Checking dependencies for modules/imap/imap_metadata.c
Checking dependencies for modules/imap/imap_list.c
Checking dependencies for modules/imap/imap_fetch.c
Checking dependencies for modules/imap/imap_acl.c
Checking dependencies for modules/image/serv_image.c
Checking dependencies for modules/fulltext/serv_fulltext.c
Checking dependencies for modules/fulltext/ft_wordbreaker.c
Checking dependencies for modules/fulltext/crc16.c
Checking dependencies for modules/expire/serv_expire.c
Checking dependencies for modules/expire/expire_policy.c
Checking dependencies for modules/ctdlproto/serv_user.c
Checking dependencies for modules/ctdlproto/serv_syscmds.c
Checking dependencies for modules/ctdlproto/serv_session.c
Checking dependencies for modules/ctdlproto/serv_rooms.c
Checking dependencies for modules/ctdlproto/serv_messages.c
Checking dependencies for modules/ctdlproto/serv_file.c
Checking dependencies for modules/ctdlproto/serv_ctdlproto.c
Checking dependencies for modules/crypto/serv_crypto.c
Checking dependencies for modules/clamav/serv_virus.c
Checking dependencies for modules/checkpoint/serv_checkpoint.c
Checking dependencies for modules/calendar/serv_calendar.c
Checking dependencies for modules/blog/serv_blog.c
Checking dependencies for modules/bio/serv_bio.c
Checking dependencies for modules/autocompletion/serv_autocompletion.c

Dependencies: gcc -M -I/usr/local/ctdlsupport/include  -g -I/usr/local/ctdlsupport/include -I. -I ./include/  | sed -e 's!.o!.o /.o buildinfo!' > buildinfo
Compile: gcc -I/usr/local/citadel  -I/usr/local/ctdlsupport/include  -g -Wall -Wcast-qual -Wcast-align -Wstrict-prototypes -Wno-strict-aliasing -D_REENTRANT -pthread -I ./include/ -I/usr/local/ctdlsupport/include  -g -I/usr/local/ctdlsupport/include -I. -I ./include/ -DHAVE_CONFIG_H -DDIFF="/usr/bin/diff" -DPATCH="/usr/bin/patch" -c  -o buildinfo
LDFLAGS: -L/usr/local/citadel -L/usr/local/ctdlsupport/lib -Wl,--rpath -Wl,/usr/local/ctdlsupport/lib  -L/usr/local/ctdlsupport/lib

CC server_main.c
CC utillib/citadel_dirs.c
CC user_ops.c
CC citserver.c
CC sysdep.c
CC serv_extensions.c
CC database.c
CC domain.c
CC control.c
control.c: In function 'control_find_highest':
control.c:67:13: warning: cast increases required alignment of target type [-Wcast-align]
   msglist = (long *) cdbfr->ptr;
             ^
CC config.c
CC support.c
CC room_ops.c
room_ops.c: In function 'CtdlUserGoto':
room_ops.c:848:20: warning: cast increases required alignment of target type [-Wcast-align]
          msglist = (long *) cdbfr->ptr;
                    ^
CC msgbase.c
msgbase.c: In function 'CtdlSetSeen':
msgbase.c:473:13: warning: cast increases required alignment of target type [-Wcast-align]
   msglist = (long *) cdbfr->ptr;
             ^
msgbase.c: In function 'CtdlForEachMessage':
msgbase.c:704:12: warning: cast increases required alignment of target type [-Wcast-align]
  msglist = (long *) cdbfr->ptr;
            ^
msgbase.c: In function 'CtdlSaveMsgPointersInRoom':
msgbase.c:2380:13: warning: cast increases required alignment of target type [-Wcast-align]
   msglist = (long *) cdbfr->ptr;
             ^
msgbase.c: In function 'CtdlDeleteMessages':
msgbase.c:3400:13: warning: cast increases required alignment of target type [-Wcast-align]
   msglist = (long *) cdbfr->ptr;
             ^
CC euidindex.c
euidindex.c: In function 'cmd_euid':
euidindex.c:211:27: warning: cast increases required alignment of target type [-Wcast-align]
                 msglist = (long *) cdbfr->ptr;
                           ^
CC locate_host.c
CC housekeeping.c
CC ical_dezonify.c
CC internet_addressing.c
CC journaling.c
CC parsedate.c
CC genstamp.c
CC ecrash.c
CC threads.c
CC context.c
CC clientsocket.c
CC modules_init.c
CC modules_upgrade.c
CC modules/autocompletion/serv_autocompletion.c
CC modules/bio/serv_bio.c
modules/bio/serv_bio.c: In function 'import_old_bio_files':
modules/bio/serv_bio.c:169:2: warning: 'readdir_r' is deprecated [-Wdeprecated-declarations]
  while ((readdir_r(filedir, d, &filedir_entry) == 0) &&
  ^~~~~
In file included from modules/bio/serv_bio.c:23:0:
/usr/include/dirent.h:183:12: note: declared here
 extern int readdir_r (DIR *__restrict __dirp,
            ^~~~~~~~~
CC modules/blog/serv_blog.c
CC modules/calendar/serv_calendar.c
modules/calendar/serv_calendar.c: In function 'ical_send_out_invitations':
modules/calendar/serv_calendar.c:2151:51: warning: passing argument 1 of 'icaltimezone_get_tzid' discards 'const' qualifier from pointer target type [-Wdiscarded-qualifiers]
      icalparameter_new_tzid(icaltimezone_get_tzid(z))
                                                   ^
In file included from modules/calendar/serv_calendar.c:21:0:
/usr/local/ctdlsupport/include/libical/ical.h:3183:13: note: expected 'icaltimezone * {aka struct _icaltimezone *}' but argument is of type 'const icaltimezone * {aka const struct _icaltimezone *}'
 const char* icaltimezone_get_tzid   (icaltimezone *zone);
             ^~~~~~~~~~~~~~~~~~~~~
modules/calendar/serv_calendar.c:2160:59: warning: passing argument 1 of 'icaltimezone_get_component' discards 'const' qualifier from pointer target type [-Wdiscarded-qualifiers]
   zc = icalcomponent_new_clone(icaltimezone_get_component(attached_zones[i]));
                                                           ^~~~~~~~~~~~~~
In file included from modules/calendar/serv_calendar.c:21:0:
/usr/local/ctdlsupport/include/libical/ical.h:3201:16: note: expected 'icaltimezone * {aka struct _icaltimezone *}' but argument is of type 'const icaltimezone * {aka const struct _icaltimezone *}'
 icalcomponent* icaltimezone_get_component (icaltimezone *zone);
                ^~~~~~~~~~~~~~~~~~~~~~~~~~
CC modules/checkpoint/serv_checkpoint.c
CC modules/clamav/serv_virus.c
CC modules/crypto/serv_crypto.c
modules/crypto/serv_crypto.c: In function 'init_ssl':
modules/crypto/serv_crypto.c:87:3: warning: implicit declaration of function 'RAND_egd' [-Wimplicit-function-declaration]
   RAND_egd(EGD_POOL);
   ^~~~~~~~
modules/crypto/serv_crypto.c:147:22: error: dereferencing pointer to incomplete type 'DH {aka struct dh_st}'
  if (!(BN_hex2bn(&(dh->p), DH_P))) {
                      ^~
modules/crypto/serv_crypto.c:173:3: warning: 'RSA_generate_key' is deprecated [-Wdeprecated-declarations]
   rsa = RSA_generate_key(1024, /* modulus size */
   ^~~
In file included from /usr/include/openssl/rsa.h:13:0,
                 from /usr/include/openssl/x509.h:31,
                 from /usr/include/openssl/ssl.h:50,
                 from modules/crypto/serv_crypto.c:20:
/usr/include/openssl/rsa.h:193:1: note: declared here
 DEPRECATEDIN_0_9_8(RSA *RSA_generate_key(int bits, unsigned long e, void
 ^
modules/crypto/serv_crypto.c:305:35: error: dereferencing pointer to incomplete type 'X509_REQ {aka struct X509_req_st}'
      X509_set_issuer_name(cer, req->req_info->subject);
                                   ^~
In file included from /usr/include/openssl/ssl.h:48:0,
                 from modules/crypto/serv_crypto.c:20:
modules/crypto/serv_crypto.c: In function 'CtdlStartTLS':
modules/crypto/serv_crypto.c:637:23: error: dereferencing pointer to incomplete type 'SSL {aka struct ssl_st}'
  BIO_set_close(CC->ssl->rbio, BIO_NOCLOSE);
                       ^
At top level:
modules/crypto/serv_crypto.c:61:22: warning: 'id_callback' defined but not used [-Wunused-function]
 static unsigned long id_callback(void)
                      ^~~~~~~~~~~
Makefile:145: recipe for target 'modules/crypto/serv_crypto.o' failed
make: *** [modules/crypto/serv_crypto.o] Error 1
Operating system: Linux Debian 9.1 ( 4.9.41-v7+ armv7l)



 



[#] Tue Oct 03 2017 17:14:28 EDT from vhero @ Uncensored

Subject: Email-Server Congratulation Issue

[Reply] [ReplyQuoted] [Headers] [Print]

I'm having a bit of an issue configuring the email-server. When sending emails to hero@website.com from an outside host like gmail.com it tells me I have a relay issue, and that sending has failed. 

If someone can point me or guide me to how I can allow the email hero@website.com to be emailed to by outside host users it would be great, I'm knew to this mail-server and linux really.



[#] Tue Oct 03 2017 17:13:15 EDT from bennabiy @ Uncensored

Subject: Re: RPi2 Debian Stretch: Easy Install failing at serv_crypto.o

[Reply] [ReplyQuoted] [Headers] [Print]

This might have something to do with it...

In file included from /usr/include/openssl/ssl.h:48:0,
                 from modules/crypto/serv_crypto.c:20:
modules/crypto/serv_crypto.c: In function 'CtdlStartTLS':
modules/crypto/serv_crypto.c:637:23: error: dereferencing pointer to incomplete type 'SSL {aka struct ssl_st}'
  BIO_set_close(CC->ssl->rbio, BIO_NOCLOSE);
                       ^



[#] Tue Oct 03 2017 20:53:39 EDT from bennabiy @ Uncensored

Subject: Re: Email-Server Congratulation Issue

[Reply] [ReplyQuoted] [Headers] [Print]

vhero, please do not keep posting the same post over and over again. Please change screens and then come back to the support room, or you will keep posting the same thing accidentally.

Tue Oct 03 2017 05:14:28 PM EDT from vhero @ Uncensored Subject: Email-Server Congratulation Issue

I'm having a bit of an issue configuring the email-server. When sending emails to hero@website.com from an outside host like gmail.com it tells me I have a relay issue, and that sending has failed. 

If someone can point me or guide me to how I can allow the email hero@website.com to be emailed to by outside host users it would be great, I'm knew to this mail-server and linux really.



 



[#] Wed Oct 04 2017 01:52:02 EDT from madpoet @ Uncensored

Subject: Re: RPi2 Debian Stretch: Easy Install failing at serv_crypto.o

[Reply] [ReplyQuoted] [Headers] [Print]

Yes, that is correct, as per another similar thread I also installed zlib, please see below;

 

As per: http://citadel.org/doku.php/installation:easyinstall:prereq-debian.html

 - Followed the instructions

Prerequisites for Debian and Ubuntu systems:

You probably might have noticed, the citadel team provides debian/ubuntu binary packages.
Anyway, Easy Install requires a working build environment. This is installed by default on nearly all modern Linux distributions. The notable exception to this is Ubuntu, which does not ship with a working build environment. To install a build environment use the following commands (as root):

apt-get update
apt-get install build-essential curl g++ gettext shared-mime-info libssl-dev

Then run Easy Install the normal way:

curl http://easyinstall.citadel.org/install | bash

build-essential is already the newest version (12.3).
curl is already the newest version (7.52.1-5).
g++ is already the newest version (4:6.3.0-4).
gettext is already the newest version (0.19.8.1-2).
libssl-dev is already the newest version (1.1.0f-3).
shared-mime-info is already the newest version (1.8-1).

Tue Oct 03 2017 04:09:16 EDT from madpoet @ Uncensored Subject: RPi2 Debian Stretch: Easy Install failing at serv_crypto.o

RPi2 Debian Stretch: Easy Install failing at serv_crypto.o
Platform: Raspberry Pi 2
Operating system: Linux Debian 9.1 ( 4.9.41-v7+ armv7l)

 

zlib1g is already the newest version (1:1.2.8.dfsg-5).
zlib1g-dev is already the newest version (1:1.2.8.dfsg-5).

Tue Oct 03 2017 17:03:17 EDT from bennabiy @ Uncensored Subject: Re: RPi2 Debian Stretch: Easy Install failing at serv_crypto.o

You did install all dependencies, correct?

Tue Oct 03 2017 04:09:16 AM EDT from madpoet @ Uncensored Subject: RPi2 Debian Stretch: Easy Install failing at serv_crypto.o

RPi2 Debian Stretch: Easy Install failing at serv_crypto.o
Platform: Raspberry Pi 2
Operating system: Linux Debian 9.1 ( 4.9.41-v7+ armv7l)
emohym:~$ cat /tmp/citadel-install-log.txt   
--2017-10-03 07:36:25--  http://easyinstall.citadel.org/gpl.txt
Resolving easyinstall.citadel.org (easyinstall.citadel.org)... 216.150.130.115
Connecting to easyinstall.citadel.org (easyinstall.citadel.org)|216.150.130.115|:80... connected.
HTTP request sent, awaiting response... 200 OK
Length: 32553 (32K) [text/plain]
Saving to: 'gpl.txt'

     0K .......... .......... .......... .                    100%  119K=0.3s

2017-10-03 07:36:26 (119 KB/s) - 'gpl.txt' saved [32553/32553]

--2017-10-03 07:36:29--  http://easyinstall.citadel.org/libical-easyinstall.sum
Resolving easyinstall.citadel.org (easyinstall.citadel.org)... 216.150.130.115
Connecting to easyinstall.citadel.org (easyinstall.citadel.org)|216.150.130.115|:80... connected.
HTTP request sent, awaiting response... 200 OK
Length: 33 [text/plain]
Saving to: 'libical-easyinstall.sum'

     0K                                                       100%  831K=0s

2017-10-03 07:36:29 (831 KB/s) - 'libical-easyinstall.sum' saved [33/33]

--2017-10-03 07:36:29--  http://easyinstall.citadel.org/libsieve-easyinstall.sum
Resolving easyinstall.citadel.org (easyinstall.citadel.org)... 216.150.130.115
Connecting to easyinstall.citadel.org (easyinstall.citadel.org)|216.150.130.115|:80... connected.
HTTP request sent, awaiting response... 200 OK
Length: 9 [text/plain]
Saving to: 'libsieve-easyinstall.sum'

     0K                                                       100%  204K=0s

2017-10-03 07:36:30 (204 KB/s) - 'libsieve-easyinstall.sum' saved [9/9]

--2017-10-03 07:36:30--  http://easyinstall.citadel.org/db-easyinstall.sum
Resolving easyinstall.citadel.org (easyinstall.citadel.org)... 216.150.130.115
Connecting to easyinstall.citadel.org (easyinstall.citadel.org)|216.150.130.115|:80... connected.
HTTP request sent, awaiting response... 200 OK
Length: 33 [text/plain]
Saving to: 'db-easyinstall.sum'

     0K                                                       100%  820K=0s

2017-10-03 07:36:30 (820 KB/s) - 'db-easyinstall.sum' saved [33/33]

--2017-10-03 07:36:30--  http://easyinstall.citadel.org/expat-easyinstall.sum
Resolving easyinstall.citadel.org (easyinstall.citadel.org)... 216.150.130.115
Connecting to easyinstall.citadel.org (easyinstall.citadel.org)|216.150.130.115|:80... connected.
HTTP request sent, awaiting response... 200 OK
Length: 33 [text/plain]
Saving to: 'expat-easyinstall.sum'

     0K                                                       100%  726K=0s

2017-10-03 07:36:30 (726 KB/s) - 'expat-easyinstall.sum' saved [33/33]

--2017-10-03 07:36:30--  http://easyinstall.citadel.org/libcurl-easyinstall.sum
Resolving easyinstall.citadel.org (easyinstall.citadel.org)... 216.150.130.115
Connecting to easyinstall.citadel.org (easyinstall.citadel.org)|216.150.130.115|:80... connected.
HTTP request sent, awaiting response... 200 OK
Length: 33 [text/plain]
Saving to: 'libcurl-easyinstall.sum'

     0K                                                       100%  832K=0s

2017-10-03 07:36:30 (832 KB/s) - 'libcurl-easyinstall.sum' saved [33/33]

--2017-10-03 07:36:30--  http://easyinstall.citadel.org/libcitadel-easyinstall.sum
Resolving easyinstall.citadel.org (easyinstall.citadel.org)... 216.150.130.115
Connecting to easyinstall.citadel.org (easyinstall.citadel.org)|216.150.130.115|:80... connected.
HTTP request sent, awaiting response... 200 OK
Length: 41 [text/plain]
Saving to: 'libcitadel-easyinstall.sum'

     0K                                                       100%  938K=0s

2017-10-03 07:36:31 (938 KB/s) - 'libcitadel-easyinstall.sum' saved [41/41]

--2017-10-03 07:36:31--  http://easyinstall.citadel.org/citadel-easyinstall.sum
Resolving easyinstall.citadel.org (easyinstall.citadel.org)... 216.150.130.115
Connecting to easyinstall.citadel.org (easyinstall.citadel.org)|216.150.130.115|:80... connected.
HTTP request sent, awaiting response... 200 OK
Length: 41 [text/plain]
Saving to: 'citadel-easyinstall.sum'

     0K                                                       100% 1.07M=0s

2017-10-03 07:36:31 (1.07 MB/s) - 'citadel-easyinstall.sum' saved [41/41]

--2017-10-03 07:36:31--  http://easyinstall.citadel.org/citadel-easyinstall.tar.gz
Resolving easyinstall.citadel.org (easyinstall.citadel.org)... 216.150.130.115
Connecting to easyinstall.citadel.org (easyinstall.citadel.org)|216.150.130.115|:80... connected.
HTTP request sent, awaiting response... 200 OK
Length: 733679 (716K) [application/x-gzip]
Saving to: 'citadel-easyinstall.tar.gz'

     0K .......... .......... .......... .......... ..........  6%  176K 4s
    50K .......... .......... .......... .......... .......... 13%  501K 2s
   100K .......... .......... .......... .......... .......... 20%  581K 2s
   150K .......... .......... .......... .......... .......... 27% 1.65M 1s
   200K .......... .......... .......... .......... .......... 34%  712K 1s
   250K .......... .......... .......... .......... .......... 41% 2.04M 1s
   300K .......... .......... .......... .......... .......... 48% 1.84M 1s
   350K .......... .......... .......... .......... .......... 55% 1.24M 1s
   400K .......... .......... .......... .......... .......... 62% 2.06M 0s
   450K .......... .......... .......... .......... .......... 69% 1.88M 0s
   500K .......... .......... .......... .......... .......... 76% 2.09M 0s
   550K .......... .......... .......... .......... .......... 83% 1.81M 0s
   600K .......... .......... .......... .......... .......... 90% 2.05M 0s
   650K .......... .......... .......... .......... .......... 97%  504K 0s
   700K .......... ......                                     100% 18.1M=0.9s

2017-10-03 07:36:32 (811 KB/s) - 'citadel-easyinstall.tar.gz' saved [733679/733679]

configure: WARNING: unrecognized options: --with-libical, --disable-threaded-client
checking for gcc... gcc
checking whether the C compiler works... yes
checking for C compiler default output file name... a.out
checking for suffix of executables...
checking whether we are cross compiling... no
checking for suffix of object files... o
checking whether we are using the GNU C compiler... yes
checking whether gcc accepts -g... yes
checking for gcc option to accept ISO C89... none needed
checking how to run the C preprocessor... gcc -E
checking for grep that handles long lines and -e... /bin/grep
checking for egrep... /bin/grep -E
checking for ANSI C header files... yes
checking for sys/types.h... yes
checking for sys/stat.h... yes
checking for stdlib.h... yes
checking for string.h... yes
checking for memory.h... yes
checking for strings.h... yes
checking for inttypes.h... yes
checking for stdint.h... yes
checking for unistd.h... yes
checking minix/config.h usability... no
checking minix/config.h presence... no
checking for minix/config.h... no
checking whether it is safe to define __EXTENSIONS__... yes
checking zlib.h usability... yes
checking zlib.h presence... yes
checking for zlib.h... yes
checking for zlibVersion in -lz... yes
checking Checking to see if your system supports iconv... yes
Citadel will be built with character set conversion.
checking for libintl_bindtextdomain in -lintl... no
checking build system type... armv7l-unknown-linux-gnu
checking host system type... armv7l-unknown-linux-gnu
checking how to compile with POSIX threads... Linux
checking for gcc... (cached) gcc
checking whether we are using the GNU C compiler... (cached) yes
checking whether gcc accepts -g... (cached) yes
checking for gcc option to accept ISO C89... (cached) none needed
checking how to create dependancy checks... checking for a BSD-compatible install... /usr/bin/install -c
checking for bison... no
checking for byacc... no
checking for diff... /usr/bin/diff
checking for patch... /usr/bin/patch
/tmp/citadel-build.575/citadel/missing: Unknown `--is-lightweight' option
Try `/tmp/citadel-build.575/citadel/missing --help' for more information
configure: WARNING: 'missing' script is too old or missing
checking size of char... 1
checking size of short... 2
checking size of int... 4
checking size of long... 4
checking size of size_t... 4
checking size of loff_t... 8
checking for crypt... no
checking for gethostbyname... yes
checking for connect... yes
checking for getpwnam_r... yes
checking for getpwuid_r... yes
checking for getloadavg... yes
checking for strftime_l... yes
checking for uselocale... yes
checking for gettext... yes
checking for xgettext... yes
checking for msgmerge... yes
checking for msgfmt... yes
citadel will be built with national language support.
checking for sched_yield in -lrt... yes
checking for pam_start in -lpam... no
checking for pam_start... no
checking for library containing getspnam... none required
checking for crypt in -lcrypt... yes
checking for vw_printw... no
checking for wcolor_set... no
checking for resizeterm... no
checking for wresize... no
checking for pthread_create in -lpthread... yes
checking for pthread_create in -lpthreads... no
checking libical/ical.h usability... yes
checking libical/ical.h presence... yes
checking for libical/ical.h... yes
checking for icaltimezone_set_tzid_prefix in -lical... yes
checking sieve2.h usability... yes
checking sieve2.h presence... yes
checking for sieve2.h... yes
checking for sieve2_license in -lsieve... yes
checking libcitadel.h usability... yes
checking libcitadel.h presence... yes
checking for libcitadel.h... yes
checking for libcitadel_version_string in -lcitadel... yes
checking for OpenSSL... /usr/local/citadel
checking for db_create in -ldb... yes
checking ldap.h usability... no
checking ldap.h presence... no
checking for ldap.h... no
checking expat.h usability... yes
checking expat.h presence... yes
checking for expat.h... yes
checking for XML_ParserCreateNS in -lexpat... yes
checking curl/curl.h usability... yes
checking curl/curl.h presence... yes
checking for curl/curl.h... yes
checking for curl_version in -lcurl... yes
checking for dirent.h that defines DIR... yes
checking for library containing opendir... none required
checking for ANSI C header files... (cached) yes
checking for sys/wait.h that is POSIX.1 compatible... yes
checking dl.h usability... no
checking dl.h presence... no
checking for dl.h... no
checking fcntl.h usability... yes
checking fcntl.h presence... yes
checking for fcntl.h... yes
checking limits.h usability... yes
checking limits.h presence... yes
checking for limits.h... yes
checking malloc.h usability... yes
checking malloc.h presence... yes
checking for malloc.h... yes
checking termios.h usability... yes
checking termios.h presence... yes
checking for termios.h... yes
checking sys/ioctl.h usability... yes
checking sys/ioctl.h presence... yes
checking for sys/ioctl.h... yes
checking sys/select.h usability... yes
checking sys/select.h presence... yes
checking for sys/select.h... yes
checking for sys/stat.h... (cached) yes
checking sys/time.h usability... yes
checking sys/time.h presence... yes
checking for sys/time.h... yes
checking sys/prctl.h usability... yes
checking sys/prctl.h presence... yes
checking for sys/prctl.h... yes
checking syslog.h usability... yes
checking syslog.h presence... yes
checking for syslog.h... yes
checking for unistd.h... (cached) yes
checking utmp.h usability... yes
checking utmp.h presence... yes
checking for utmp.h... yes
checking utmpx.h usability... yes
checking utmpx.h presence... yes
checking for utmpx.h... yes
checking paths.h usability... yes
checking paths.h presence... yes
checking for paths.h... yes
checking db.h usability... yes
checking db.h presence... yes
checking for db.h... yes
checking db4/db.h usability... no
checking db4/db.h presence... no
checking for db4/db.h... no
checking pthread.h usability... yes
checking pthread.h presence... yes
checking for pthread.h... yes
checking netinet/in.h usability... yes
checking netinet/in.h presence... yes
checking for netinet/in.h... yes
checking arpa/nameser.h usability... yes
checking arpa/nameser.h presence... yes
checking for arpa/nameser.h... yes
checking arpa/nameser_compat.h usability... yes
checking arpa/nameser_compat.h presence... yes
checking for arpa/nameser_compat.h... yes
checking syscall.h usability... yes
checking syscall.h presence... yes
checking for syscall.h... yes
checking sys/syscall.h usability... yes
checking sys/syscall.h presence... yes
checking for sys/syscall.h... yes
checking for resolv.h... yes
checking for an ANSI C-conforming const... yes
checking for pid_t... yes
checking for size_t... yes
checking whether time.h and sys/time.h may both be included... yes
checking whether struct tm is in sys/time.h or time.h... time.h
checking for struct tm.tm_gmtoff... yes
checking for ut_type in struct utmp... yes
checking for call semantics from getpwuid_r... yes
checking for res_query in -lresolv... no
checking for res_query in -lresolv (with resolv.h if present)... yes
checking for ut_host in struct utmp... yes
checking whether getpgrp requires zero arguments... yes
checking whether gcc needs -traditional... no
checking return type of signal handlers... void
checking for vprintf... yes
checking for _doprnt... no
checking for getspnam... yes
checking for getutxline... yes
checking for mkdir... yes
checking for mkfifo... yes
checking for mktime... yes
checking for rmdir... yes
checking for select... yes
checking for socket... yes
checking for strerror... yes
checking for strcasecmp... yes
checking for strncasecmp... yes
checking for pthread_cancel... yes
checking for pthread_create... yes
checking the weather... opening your window... it's cool
checking under the bed... dust bunnies found
checking for struct ucred... yes
configure: creating ./config.status
config.status: creating Makefile
config.status: creating database_cleanup.sh
config.status: creating po/citadel-setup/Makefile
config.status: creating sysdep.h
configure: WARNING: unrecognized options: --with-libical, --disable-threaded-client
------------------------------------------------------------------------
LDAP support:                   
Character set conversion support: yes
Boehm-Demers-Weiser support:    

Note: if you are not using Linux, make sure you are using GNU make
(gmake) to compile Citadel.

Checking dependencies for modules_upgrade.c
Checking dependencies for modules_init.c
Checking dependencies for modules/xmpp/xmpp_sasl_service.c
Checking dependencies for modules/xmpp/xmpp_queue.c
Checking dependencies for modules/xmpp/xmpp_query_namespace.c
Checking dependencies for modules/xmpp/xmpp_presence.c
Checking dependencies for modules/xmpp/xmpp_messages.c
Checking dependencies for modules/xmpp/serv_xmpp.c
Checking dependencies for modules/wiki/serv_wiki.c
Checking dependencies for modules/vcard/serv_vcard.c
Checking dependencies for modules/upgrade/serv_upgrade.c
Checking dependencies for modules/test/serv_test.c
Checking dependencies for modules/spam/serv_spam.c
Checking dependencies for modules/smtp/smtp_util.c
Checking dependencies for modules/smtp/serv_smtpclient.c
Checking dependencies for modules/smtp/serv_smtp.c
Checking dependencies for modules/sieve/serv_sieve.c
Checking dependencies for modules/rwho/serv_rwho.c
Checking dependencies for modules/rssclient/serv_rssclient.c
Checking dependencies for modules/roomchat/serv_roomchat.c
Checking dependencies for modules/pop3client/serv_pop3client.c
Checking dependencies for modules/pop3/serv_pop3.c
Checking dependencies for modules/openid/serv_openid_rp.c
Checking dependencies for modules/notes/serv_notes.c
Checking dependencies for modules/nntp/wildmat.c
Checking dependencies for modules/nntp/serv_nntp.c
Checking dependencies for modules/newuser/serv_newuser.c
Checking dependencies for modules/networkclient/serv_networkclient.c
Checking dependencies for modules/network/serv_network.c
Checking dependencies for modules/network/serv_netspool.c
Checking dependencies for modules/network/serv_netmail.c
Checking dependencies for modules/network/serv_netfilter.c
Checking dependencies for modules/mrtg/serv_mrtg.c
Checking dependencies for modules/migrate/serv_migrate.c
Checking dependencies for modules/managesieve/serv_managesieve.c
Checking dependencies for modules/listsub/serv_listsub.c
Checking dependencies for modules/instmsg/serv_instmsg.c
Checking dependencies for modules/inetcfg/serv_inetcfg.c
Checking dependencies for modules/imap/serv_imap.c
Checking dependencies for modules/imap/imap_tools.c
Checking dependencies for modules/imap/imap_store.c
Checking dependencies for modules/imap/imap_search.c
Checking dependencies for modules/imap/imap_misc.c
Checking dependencies for modules/imap/imap_metadata.c
Checking dependencies for modules/imap/imap_list.c
Checking dependencies for modules/imap/imap_fetch.c
Checking dependencies for modules/imap/imap_acl.c
Checking dependencies for modules/image/serv_image.c
Checking dependencies for modules/fulltext/serv_fulltext.c
Checking dependencies for modules/fulltext/ft_wordbreaker.c
Checking dependencies for modules/fulltext/crc16.c
Checking dependencies for modules/expire/serv_expire.c
Checking dependencies for modules/expire/expire_policy.c
Checking dependencies for modules/ctdlproto/serv_user.c
Checking dependencies for modules/ctdlproto/serv_syscmds.c
Checking dependencies for modules/ctdlproto/serv_session.c
Checking dependencies for modules/ctdlproto/serv_rooms.c
Checking dependencies for modules/ctdlproto/serv_messages.c
Checking dependencies for modules/ctdlproto/serv_file.c
Checking dependencies for modules/ctdlproto/serv_ctdlproto.c
Checking dependencies for modules/crypto/serv_crypto.c
Checking dependencies for modules/clamav/serv_virus.c
Checking dependencies for modules/checkpoint/serv_checkpoint.c
Checking dependencies for modules/calendar/serv_calendar.c
Checking dependencies for modules/blog/serv_blog.c
Checking dependencies for modules/bio/serv_bio.c
Checking dependencies for modules/autocompletion/serv_autocompletion.c

Dependencies: gcc -M -I/usr/local/ctdlsupport/include  -g -I/usr/local/ctdlsupport/include -I. -I ./include/  | sed -e 's!.o!.o /.o buildinfo!' > buildinfo
Compile: gcc -I/usr/local/citadel  -I/usr/local/ctdlsupport/include  -g -Wall -Wcast-qual -Wcast-align -Wstrict-prototypes -Wno-strict-aliasing -D_REENTRANT -pthread -I ./include/ -I/usr/local/ctdlsupport/include  -g -I/usr/local/ctdlsupport/include -I. -I ./include/ -DHAVE_CONFIG_H -DDIFF="/usr/bin/diff" -DPATCH="/usr/bin/patch" -c  -o buildinfo
LDFLAGS: -L/usr/local/citadel -L/usr/local/ctdlsupport/lib -Wl,--rpath -Wl,/usr/local/ctdlsupport/lib  -L/usr/local/ctdlsupport/lib

CC server_main.c
CC utillib/citadel_dirs.c
CC user_ops.c
CC citserver.c
CC sysdep.c
CC serv_extensions.c
CC database.c
CC domain.c
CC control.c
control.c: In function 'control_find_highest':
control.c:67:13: warning: cast increases required alignment of target type [-Wcast-align]
   msglist = (long *) cdbfr->ptr;
             ^
CC config.c
CC support.c
CC room_ops.c
room_ops.c: In function 'CtdlUserGoto':
room_ops.c:848:20: warning: cast increases required alignment of target type [-Wcast-align]
          msglist = (long *) cdbfr->ptr;
                    ^
CC msgbase.c
msgbase.c: In function 'CtdlSetSeen':
msgbase.c:473:13: warning: cast increases required alignment of target type [-Wcast-align]
   msglist = (long *) cdbfr->ptr;
             ^
msgbase.c: In function 'CtdlForEachMessage':
msgbase.c:704:12: warning: cast increases required alignment of target type [-Wcast-align]
  msglist = (long *) cdbfr->ptr;
            ^
msgbase.c: In function 'CtdlSaveMsgPointersInRoom':
msgbase.c:2380:13: warning: cast increases required alignment of target type [-Wcast-align]
   msglist = (long *) cdbfr->ptr;
             ^
msgbase.c: In function 'CtdlDeleteMessages':
msgbase.c:3400:13: warning: cast increases required alignment of target type [-Wcast-align]
   msglist = (long *) cdbfr->ptr;
             ^
CC euidindex.c
euidindex.c: In function 'cmd_euid':
euidindex.c:211:27: warning: cast increases required alignment of target type [-Wcast-align]
                 msglist = (long *) cdbfr->ptr;
                           ^
CC locate_host.c
CC housekeeping.c
CC ical_dezonify.c
CC internet_addressing.c
CC journaling.c
CC parsedate.c
CC genstamp.c
CC ecrash.c
CC threads.c
CC context.c
CC clientsocket.c
CC modules_init.c
CC modules_upgrade.c
CC modules/autocompletion/serv_autocompletion.c
CC modules/bio/serv_bio.c
modules/bio/serv_bio.c: In function 'import_old_bio_files':
modules/bio/serv_bio.c:169:2: warning: 'readdir_r' is deprecated [-Wdeprecated-declarations]
  while ((readdir_r(filedir, d, &filedir_entry) == 0) &&
  ^~~~~
In file included from modules/bio/serv_bio.c:23:0:
/usr/include/dirent.h:183:12: note: declared here
 extern int readdir_r (DIR *__restrict __dirp,
            ^~~~~~~~~
CC modules/blog/serv_blog.c
CC modules/calendar/serv_calendar.c
modules/calendar/serv_calendar.c: In function 'ical_send_out_invitations':
modules/calendar/serv_calendar.c:2151:51: warning: passing argument 1 of 'icaltimezone_get_tzid' discards 'const' qualifier from pointer target type [-Wdiscarded-qualifiers]
      icalparameter_new_tzid(icaltimezone_get_tzid(z))
                                                   ^
In file included from modules/calendar/serv_calendar.c:21:0:
/usr/local/ctdlsupport/include/libical/ical.h:3183:13: note: expected 'icaltimezone * {aka struct _icaltimezone *}' but argument is of type 'const icaltimezone * {aka const struct _icaltimezone *}'
 const char* icaltimezone_get_tzid   (icaltimezone *zone);
             ^~~~~~~~~~~~~~~~~~~~~
modules/calendar/serv_calendar.c:2160:59: warning: passing argument 1 of 'icaltimezone_get_component' discards 'const' qualifier from pointer target type [-Wdiscarded-qualifiers]
   zc = icalcomponent_new_clone(icaltimezone_get_component(attached_zones[i]));
                                                           ^~~~~~~~~~~~~~
In file included from modules/calendar/serv_calendar.c:21:0:
/usr/local/ctdlsupport/include/libical/ical.h:3201:16: note: expected 'icaltimezone * {aka struct _icaltimezone *}' but argument is of type 'const icaltimezone * {aka const struct _icaltimezone *}'
 icalcomponent* icaltimezone_get_component (icaltimezone *zone);
                ^~~~~~~~~~~~~~~~~~~~~~~~~~
CC modules/checkpoint/serv_checkpoint.c
CC modules/clamav/serv_virus.c
CC modules/crypto/serv_crypto.c
modules/crypto/serv_crypto.c: In function 'init_ssl':
modules/crypto/serv_crypto.c:87:3: warning: implicit declaration of function 'RAND_egd' [-Wimplicit-function-declaration]
   RAND_egd(EGD_POOL);
   ^~~~~~~~
modules/crypto/serv_crypto.c:147:22: error: dereferencing pointer to incomplete type 'DH {aka struct dh_st}'
  if (!(BN_hex2bn(&(dh->p), DH_P))) {
                      ^~
modules/crypto/serv_crypto.c:173:3: warning: 'RSA_generate_key' is deprecated [-Wdeprecated-declarations]
   rsa = RSA_generate_key(1024, /* modulus size */
   ^~~
In file included from /usr/include/openssl/rsa.h:13:0,
                 from /usr/include/openssl/x509.h:31,
                 from /usr/include/openssl/ssl.h:50,
                 from modules/crypto/serv_crypto.c:20:
/usr/include/openssl/rsa.h:193:1: note: declared here
 DEPRECATEDIN_0_9_8(RSA *RSA_generate_key(int bits, unsigned long e, void
 ^
modules/crypto/serv_crypto.c:305:35: error: dereferencing pointer to incomplete type 'X509_REQ {aka struct X509_req_st}'
      X509_set_issuer_name(cer, req->req_info->subject);
                                   ^~
In file included from /usr/include/openssl/ssl.h:48:0,
                 from modules/crypto/serv_crypto.c:20:
modules/crypto/serv_crypto.c: In function 'CtdlStartTLS':
modules/crypto/serv_crypto.c:637:23: error: dereferencing pointer to incomplete type 'SSL {aka struct ssl_st}'
  BIO_set_close(CC->ssl->rbio, BIO_NOCLOSE);
                       ^
At top level:
modules/crypto/serv_crypto.c:61:22: warning: 'id_callback' defined but not used [-Wunused-function]
 static unsigned long id_callback(void)
                      ^~~~~~~~~~~
Makefile:145: recipe for target 'modules/crypto/serv_crypto.o' failed
make: *** [modules/crypto/serv_crypto.o] Error 1
Operating system: Linux Debian 9.1 ( 4.9.41-v7+ armv7l)



 



 



[#] Wed Oct 04 2017 01:53:27 EDT from madpoet @ Uncensored

Subject: Re: RPi2 Debian Stretch: Easy Install failing at serv_crypto.o

[Reply] [ReplyQuoted] [Headers] [Print]

Yes, agreed. My google-fu is failing on this as well though. I am getting no where troubleshooting it. Do you have any suggestions?

Tue Oct 03 2017 17:13:15 EDT from bennabiy @ Uncensored Subject: Re: RPi2 Debian Stretch: Easy Install failing at serv_crypto.o

This might have something to do with it...

In file included from /usr/include/openssl/ssl.h:48:0,
                 from modules/crypto/serv_crypto.c:20:
modules/crypto/serv_crypto.c: In function 'CtdlStartTLS':
modules/crypto/serv_crypto.c:637:23: error: dereferencing pointer to incomplete type 'SSL {aka struct ssl_st}'
  BIO_set_close(CC->ssl->rbio, BIO_NOCLOSE);
                       ^



 



[#] Wed Oct 04 2017 07:43:01 EDT from Aleksas @ Uncensored

[Reply] [ReplyQuoted] [Headers] [Print]

Hello, how do I check how many exactly emails have bounced in the smtp outbound quene, I need raw numbers, how do I do that ? And how do I extract those numbers in python script ?



[#] Thu Oct 05 2017 11:48:39 EDT from bennabiy @ Uncensored

Subject: Re: RPi2 Debian Stretch: Easy Install failing at serv_crypto.o

[Reply] [ReplyQuoted] [Headers] [Print]

Is it possible that the RPi repos you are using might not have the full versions of the dependencies? I know it compiles fine on a standard system, and have not tried it on a pi yet. I would check to make sure you have the correct openssl dev packages and that might mean compiling openssl for your pi.

Wed Oct 04 2017 01:53:27 AM EDT from madpoet @ Uncensored Subject: Re: RPi2 Debian Stretch: Easy Install failing at serv_crypto.o

Yes, agreed. My google-fu is failing on this as well though. I am getting no where troubleshooting it. Do you have any suggestions?

Tue Oct 03 2017 17:13:15 EDT from bennabiy @ Uncensored Subject: Re: RPi2 Debian Stretch: Easy Install failing at serv_crypto.o

This might have something to do with it...

In file included from /usr/include/openssl/ssl.h:48:0,
                 from modules/crypto/serv_crypto.c:20:
modules/crypto/serv_crypto.c: In function 'CtdlStartTLS':
modules/crypto/serv_crypto.c:637:23: error: dereferencing pointer to incomplete type 'SSL {aka struct ssl_st}'
  BIO_set_close(CC->ssl->rbio, BIO_NOCLOSE);
                       ^



 



 



[#] Thu Oct 05 2017 11:49:47 EDT from bennabiy @ Uncensored

[Reply] [ReplyQuoted] [Headers] [Print]

Log parsing perhaps? (If you need it to be python friendly) 

Wed Oct 04 2017 07:43:01 AM EDT from Aleksas @ Uncensored

Hello, how do I check how many exactly emails have bounced in the smtp outbound quene, I need raw numbers, how do I do that ? And how do I extract those numbers in python script ?



 



[#] Sun Oct 08 2017 08:36:46 EDT from jiten @ Uncensored

Subject: how to setup GAJIM as XMPP client

[Reply] [ReplyQuoted] [Headers] [Print]



[#] Sun Oct 08 2017 08:37:21 EDT from jiten @ Uncensored

Subject: XMPP CLIENT GAJIM

[Reply] [ReplyQuoted] [Headers] [Print]

 

I am not able to connect to XMPP server through GAJIM client



[#] Sun Oct 08 2017 12:44:23 EDT from bennabiy @ Uncensored

Subject: Re: how to setup GAJIM as XMPP client

[Reply] [ReplyQuoted] [Headers] [Print]

Well, I would recommend looking at GAJIM's site and seeing if they have instructions. XMPP is typically on port 5222 by default, but you will have to make sure you have the firewall open for that (be wise, don't blindly open the firewall if you are not ready)...

 

The only part citadel plays is providing the service you are connecting to, so make sure your ports are configured, and you should be able to follow the directions GAJIM provides.

Sun Oct 08 2017 08:36:46 AM EDT from jiten @ Uncensored Subject: how to setup GAJIM as XMPP client


 



[#] Sun Oct 08 2017 16:42:18 EDT from mjkerpan @ Uncensored

Subject: Citadel build fails

[Reply] [ReplyQuoted] [Headers] [Print]

When attempting to install Citadel on a VPS running Debian 9 (stretch), the process fails while trying to build libcitadel. I've attached the last 100 lines of the log. What's going on here and how may I fix it.



citadelbuildfail.txt (text/plain, 7961 bytes) [View| Download]
[#] Sun Oct 08 2017 17:20:20 EDT from bennabiy @ Uncensored

Subject: Re: Citadel build fails

[Reply] [ReplyQuoted] [Headers] [Print]

Did you install all required dependencies as per the "Fine Manual"?

Sun Oct 08 2017 04:42:18 PM EDT from mjkerpan @ Uncensored Subject: Citadel build fails

When attempting to install Citadel on a VPS running Debian 9 (stretch), the process fails while trying to build libcitadel. I've attached the last 100 lines of the log. What's going on here and how may I fix it.



(, 0 bytes) [View| Download]

 



citadelbuildfail.txt (text/plain, 7961 bytes) [View| Download]
[#] Sun Oct 08 2017 17:56:28 EDT from mjkerpan @ Uncensored

Subject: Re: Citadel build fails

[Reply] [ReplyQuoted] [Headers] [Print]

 

Sun Oct 08 2017 17:20:20 EDTfrom bennabiy @ Uncensored Subject: Re: Citadel build fails

Did you install all required dependencies as per the "Fine Manual"?

I followed the directions at http://citadel.org/doku.php/installation:easyinstall:prereq-debian.html. Going back through the logs, it appears that zlib and its development packages weeded to be installed before libcitadel would compile. However, after filling that dependecy, Citadel still won't build: now I'm having problems with serv_crypto.c I have libssl and its headers installed, so it SHOULD be working, but it doesn't. What gives.



citadelbuildfail.txt (text/plain, 7961 bytes) [View| Download]
[#] Mon Oct 09 2017 05:12:26 EDT from madpoet @ Uncensored

Subject: Re: RPi2 Debian Stretch: Easy Install failing at serv_crypto.o

[Reply] [ReplyQuoted] [Headers] [Print]

I suppose that could be the case. In previous updates to this thread, I include the versions/package info for all the packages noted as needed on the install site. I tried to compile it without easy install and I get the same results. If you would like me to manually compile anything, please let me know what.

 

Thu Oct 05 2017 11:48:39 EDT from bennabiy @ Uncensored Subject: Re: RPi2 Debian Stretch: Easy Install failing at serv_crypto.o

Is it possible that the RPi repos you are using might not have the full versions of the dependencies? I know it compiles fine on a standard system, and have not tried it on a pi yet. I would check to make sure you have the correct openssl dev packages and that might mean compiling openssl for your pi.

Wed Oct 04 2017 01:53:27 AM EDT from madpoet @ Uncensored Subject: Re: RPi2 Debian Stretch: Easy Install failing at serv_crypto.o

Yes, agreed. My google-fu is failing on this as well though. I am getting no where troubleshooting it. Do you have any suggestions?

Tue Oct 03 2017 17:13:15 EDT from bennabiy @ Uncensored Subject: Re: RPi2 Debian Stretch: Easy Install failing at serv_crypto.o

This might have something to do with it...

In file included from /usr/include/openssl/ssl.h:48:0,
                 from modules/crypto/serv_crypto.c:20:
modules/crypto/serv_crypto.c: In function 'CtdlStartTLS':
modules/crypto/serv_crypto.c:637:23: error: dereferencing pointer to incomplete type 'SSL {aka struct ssl_st}'
  BIO_set_close(CC->ssl->rbio, BIO_NOCLOSE);
                       ^



 



 



 



[#] Mon Oct 09 2017 05:14:26 EDT from madpoet @ Uncensored

Subject: Re: Citadel build fails

[Reply] [ReplyQuoted] [Headers] [Print]

This appears to be the same issue I am experiencing with a raspberry pi 2 on Debian (raspbian) stretch.

Sun Oct 08 2017 17:56:28 EDT from mjkerpan @ Uncensored Subject: Re: Citadel build fails

 

Sun Oct 08 2017 17:20:20 EDTfrom bennabiy @ Uncensored Subject: Re: Citadel build fails

Did you install all required dependencies as per the "Fine Manual"?

I followed the directions at http://citadel.org/doku.php/installation:easyinstall:prereq-debian.html. Going back through the logs, it appears that zlib and its development packages weeded to be installed before libcitadel would compile. However, after filling that dependecy, Citadel still won't build: now I'm having problems with serv_crypto.c I have libssl and its headers installed, so it SHOULD be working, but it doesn't. What gives.



(, 0 bytes) [View| Download]

 



citadelbuildfail.txt (text/plain, 7961 bytes) [View| Download]
[#] Mon Oct 09 2017 11:33:21 EDT from mjkerpan @ Uncensored

Subject: Re: Citadel build fails

[Reply] [ReplyQuoted] [Headers] [Print]

 

Mon Oct 09 2017 05:14:26 EDTfrom madpoet @ Uncensored Subject: Re: Citadel build fails

This appears to be the same issue I am experiencing with a raspberry pi 2 on Debian (raspbian) stretch.

So it seems that this is a generic problem with the libraries included with Debian Stretch, then since it's happening on both AMD64 and ARM...


citadelbuildfail.txt (text/plain, 7961 bytes) [View| Download]
[#] Mon Oct 09 2017 13:35:33 EDT from bennabiy @ Uncensored

Subject: Re: Citadel build fails

[Reply] [ReplyQuoted] [Headers] [Print]

I think that is a safe assumption. 

Mon Oct 09 2017 11:33:21 AM EDT from mjkerpan @ Uncensored Subject: Re: Citadel build fails

 

Mon Oct 09 2017 05:14:26 EDTfrom madpoet @ Uncensored Subject: Re: Citadel build fails

This appears to be the same issue I am experiencing with a raspberry pi 2 on Debian (raspbian) stretch.

So it seems that this is a generic problem with the libraries included with Debian Stretch, then since it's happening on both AMD64 and ARM...


(, 0 bytes) [View| Download]

 



citadelbuildfail.txt (text/plain, 7961 bytes) [View| Download]
[#] Mon Oct 09 2017 21:30:37 EDT from Pytry @ Uncensored

Subject: admin login on raspbian

[Reply] [ReplyQuoted] [Headers] [Print]

After I first isntall citadel-suite, and when I try to login to the webcit gui with default admin and settings, I get logged out automatically (no errors).

I'm unable to create new users.

When I go through the setup, I will change the user to run as to "citadel", but the next time I run it, it still thinks it is root.

I'm new ro all of this.

 



Go to page: First ... 115 116 117 118 [119] 120 121 122 123 ... Last